{"text_format":"1","workbook":"xlsx","n_sheets":7,"sheets":["Data Entry","Score Sheet","Number Sense","Patterns, Functions and Algebra","Statistics and Probability","Geometry and Measurement","Look Up tables"],"not_rendered":{"charts":0,"images":0,"macros":1,"external_links":0,"defined_names":0,"comments":0,"pivot_tables":0},"unopened":[],"bounds":{"document_bytes":16777216,"sheet_cells":100000,"rows_first":2000,"rows_last":500,"rows_between":2000,"halvings":0,"cell_chars":16384,"cell_head_chars":4096},"cells_cut":0,"cells_raw":0,"read":"whole","date_system":"1900"}

{"sheet":"Data Entry","index":0,"n_rows":13,"n_cols":2,"rows_kept":13,"cut":false,"hidden":false,"merged":[[0,0,0,1]]}
["ABE Mathematics Diagnostic Test - Form T"]
["Student's Name"]
["Student's ID"]
["Date of Birth"]
["Date Tested"]
["Site ID"]
["Proctor"]
["Enter below the Raw Score for each of the strands ","Raw Scores"]
["Number Sense"]
["Patterns, Functions, and Algebra"]
{"$rows_left_out":4}
{"sheet":"Score Sheet","index":1,"n_rows":12,"n_cols":6,"rows_kept":12,"cut":false,"hidden":false,"merged":[[0,0,0,5],[1,1,1,3],[2,1,2,3],[3,1,3,3],[4,1,4,3],[1,4,1,5],[3,4,3,5],[2,4,2,5],[4,4,4,5]]}
["ABE Diagnostic Score Report - Mathematics - Form T"]
[{"$f":"'Data Entry'!A2","v":"Student's Name"},"Date of Birth",null,null,"Site ID"]
[{"$f":"'Data Entry'!B2","v":0},{"$f":"'Data Entry'!B4","v":"00:00:00"},null,null,{"$f":"'Data Entry'!B6","v":0}]
[{"$f":"'Data Entry'!A3","v":"Student's ID"},"Date Tested",null,null,"Proctor"]
[{"$f":"'Data Entry'!B3","v":0},{"$f":"'Data Entry'!B5","v":"00:00:00"},null,null,{"$f":"'Data Entry'!B7","v":0}]
[null,"Raw Score","Scaled Score"]
["Placement Score",{"$f":"'Data Entry'!B13","v":0},{"$f":"LOOKUP(B7,'Look Up tables'!A3:B63)","v":1}]
["Strands","Raw Score","Scaled            Score","Category                Score","Category Description","Proficiency Statements"]
["Number Sense",{"$f":"'Data Entry'!B9","v":0},{"$f":"LOOKUP(B9,'Look Up tables'!D4:E19)","v":1},{"$f":"LOOKUP(C9,'Look Up tables'!G4:H18)","v":1},{"$f":"LOOKUP(D9,'Look Up tables'!D24:E26)","v":"Needs Improvement"},{"$f":"VLOOKUP(C7&D9,'Number Sense'!A:E,5,FALSE)","v":"The results suggest that you have the ability to add and subtract whole numbers up to two digits; count and make change; solve single step addition or subtraction word problems.  Recommended study: add, subtract, multiply, and divide whole numbers; solving single step word problems; understand fraction pictures."}]
["Patterns, Functions, and Algebra",{"$f":"'Data Entry'!B10","v":0},{"$f":"LOOKUP(B10,'Look Up tables'!J4:K19)","v":1},{"$f":"LOOKUP(C10,'Look Up tables'!M4:N18)","v":1},{"$f":"LOOKUP(D10,'Look Up tables'!D24:E26)","v":"Needs Improvement"},{"$f":"VLOOKUP(C7&D10,'Patterns, Functions and Algebra'!A:E,5,FALSE)","v":"The results suggest that you have the ability to construct simple pictorial patterns, Simplify expressions using the order of operation symbols (+, -). Recommended study: solve word and picture problems; identify numbers on a number line."}]
{"$rows_left_out":3}
{"sheet":"Number Sense","index":2,"n_rows":19,"n_cols":5,"rows_kept":19,"cut":false,"hidden":true,"merged":[]}
["Concatenate","Placement Score","Strand Category","Strand Category","Number Sense"]
[{"$f":"CONCATENATE(B2,D2)","v":"11"},1,"Needs Improvement",1,"The results suggest that you have the ability to add and subtract whole numbers up to two digits; count and make change; solve single step addition or subtraction word problems.  Recommended study: add, subtract, multiply, and divide whole numbers; solving single step word problems; understand fraction pictures."]
[{"$f":"CONCATENATE(B3,D3)","v":"12"},1,"Limited Proficiency",2,"The results suggest you have the ability to add, subtract, and multiply whole numbers up to two digits; divide single digit whole numbers; understand pictures of fractions;  solve single step word problems.  Recommended study: compare, order, and understand place value of whole numbers; estimate and round up to the one thousands place; find whole numbers on a number line."]
["13",1,"Proficient",3,"The results suggest that you have the ability to perform operations with whole numbers with two digits; solve single step word problems; compare, order, and understand place value of whole numbers; estimate and round up to the one thousands place; find whole numbers on a number line.  Recommended study: perform operations with multi-digit whole numbers; translate statements into expressions; recognize fractions as part over whole; compare and order fractions and decimals; plot points on a graph."]
["21",2,"Needs Improvement",1,"The results suggest that you have the ability to add and subtract whole numbers up to two digits; count and make change; solve single step addition or subtraction word problems.  Recommended study: add, subtract, multiply, and divide whole numbers; solving single step word problems; understand fraction pictures."]
["22",2,"Limited Proficiency",2,"The results suggest you have the ability to add, subtract, and multiply whole numbers up to two digits; divide single digit whole numbers; understand pictures of fractions;  solve single step word problems.  Recommended study: compare, order, and understand place value of whole numbers; estimate and round up to the one thousands place; find whole numbers on a number line."]
["23",2,"Proficient",3,"The results suggest that you have the ability to perform operations with whole numbers with two digits; solve single step word problems; compare, order, and understand place value of whole numbers; estimate and round up to the one thousands place; find whole numbers on a number line.  Recommended study: perform operations with multi-digit whole numbers; translate statements into expressions; recognize fractions as part over whole; compare and order fractions and decimals; plot points on a graph."]
["31",3,"Needs Improvement",1,"The results suggest that you have the ability to add, subtract, multiply, and divide whole numbers up to three digits; use less than and greater than to order fractions and decimals; round whole numbers; translate statements into expressions; identify integers on a number line.  Recommended study: simplify and multiply fractions; translate statements into expressions and single step equations; understand ratios."]
["32",3,"Limited Proficiency",2,"The results suggest you have the ability to perform operations with whole numbers; simplify fractions; understand ratios; translate statements into expressions and single step equations.  Recommended study: simplify and multiply fractions; understand ratios and proportions; translate and solve multi step word problems."]
["33",3,"Proficient",3,"The results suggest that you have the ability to perform operations with whole numbers; simplify and multiply fractions; understand ratios and proportions; translate and solve multi step word problems. Recommended study:  perform operations with fractions; solve ratio and proportion problems; convert among fractions, percentages, and decimals; understand basic math terminology and symbols."]
{"$rows_left_out":10}
{"sheet":"Patterns, Functions and Algebra","index":3,"n_rows":19,"n_cols":5,"rows_kept":19,"cut":false,"hidden":true,"merged":[]}
["Concatenate","Placement Score","Strand Category","Strand Category","Patterns, Functions, and Algebra"]
[{"$f":"CONCATENATE(B2,D2)","v":"11"},1,"Needs Improvement",1,"The results suggest that you have the ability to construct simple pictorial patterns, Simplify expressions using the order of operation symbols (+, -). Recommended study: solve word and picture problems; identify numbers on a number line."]
[{"$f":"CONCATENATE(B3,D3)","v":"12"},1,"Limited Proficiency",2,"The results suggest that you have the ability to solve simple real life word and picture problems using single step operations (+, -); Identify whole numbers (positive numbers including zero) on a number line. Recommended study: solve word and picture problems with multi-steps; construct simple picture and number patterns; simplify expressions using order of operations symbols (+, -, x)."]
["13",1,"Proficient",3,"The results suggest that you have the ability to solve simple real life word and picture problems using two step operations (+, -); Construct simple pictorial and numeric patterns, Simplify expressions using the order of operation symbols (+, -, x). Recommended study: Identify integers on a number line; solve linear equations."]
["21",2,"Needs Improvement",1,"The results suggest that you have the ability to construct simple pictorial patterns, Simplify expressions using the order of operation symbols (+, -). Recommended study: solve word and picture problems; identify numbers on a number line."]
["22",2,"Limited Proficiency",2,"The results suggest that you have the ability to solve simple real life word and picture problems using single step operations (+, -); Identify whole numbers (positive numbers including zero) on a number line. Recommended study: solve word and picture problems with multi-steps; construct simple picture and number patterns; simplify expressions using order of operations symbols (+, -, x)."]
["23",2,"Proficient",3,"The results suggest that you have the ability to solve simple real life word and picture problems using two step operations (+, -); Construct simple pictorial and numeric patterns, Simplify expressions using the order of operation symbols (+, -, x). Recommended study: Identify integers on a number line; solve linear equations."]
["31",3,"Needs Improvement",1,"The results suggest that you have the ability to identify integers on a number line; solve simple single-step linear equations. Recommended study: identify and plot points on an x-y - coordinate plane; solve ratio and rate problems."]
["32",3,"Limited Proficiency",2,"The results suggest that you have the ability to identify and plot points on an x -y  - coordinate plane (four quadrants); solve basic rate and ratio problems . Recommended study: simplify expressions using order of operations; translate word problems into expressions and equations; construct picture and number patterns."]
["33",3,"Proficient",3,"The results suggest that you have the ability to simplify expressions using order of operations (+, -, x, ÷); translate word problems requiring single step into expressions and equations; construct pictorial and numeric patterns. Recommended study: simplify expressions using all order of operations; evaluate expressions by substitution."]
{"$rows_left_out":10}
{"sheet":"Statistics and Probability","index":4,"n_rows":19,"n_cols":5,"rows_kept":19,"cut":false,"hidden":true,"merged":[]}
["Concatenate","Placement Score","Strand Category","Strand Category","Statistics and Probability"]
[{"$f":"CONCATENATE(B2,D2)","v":"11"},1,"Needs Improvement",1,"The results suggest that you have little to no skills in this area.  Recommended study:  calculate the average for a set of whole number values; read basic graphs such as line, circle, and bar graphs; solve simple word and picture problems involving a single step operation."]
[{"$f":"CONCATENATE(B3,D3)","v":"12"},1,"Limited Proficiency",2,"The results suggest that you have some or all of the following skills:  read basic graphs such as line, circle, and bar graphs; solve simple word and picture problems involving a single step operation.  Recommended study:  calculate the average for a set of whole number values; read and interpret basic graphs such as line, circle, and bar graphs."]
["13",1,"Proficient",3,"The results suggest that you have some or all of the following skills: calculate the average for a set of whole number values; read basic statistical charts and graphs.  Recommended study:  calculate the mean and mode for a set of whole number values; read and interpret basic graphs such as line, circle, and bar graphs."]
["21",2,"Needs Improvement",1,"The results suggest that you have little to no skills in this area.  Recommended study:  calculate the average for a set of whole number values; read basic graphs such as line, circle, and bar graphs; solve simple word and picture problems involving a single step operation."]
["22",2,"Limited Proficiency",2,"The results suggest that you have some or all of the following skills:  read basic graphs such as line, circle, and bar graphs; solve simple word and picture problems involving a single step operation.  Recommended study:  calculate the average for a set of whole number values; read and interpret basic graphs such as line, circle, and bar graphs."]
["23",2,"Proficient",3,"The results suggest that you have some or all of the following skills: calculate the average for a set of whole number values; read basic statistical charts and graphs.  Recommended study:  calculate the mean and mode for a set of whole number values; read and interpret basic graphs such as line, circle, and bar graphs."]
["31",3,"Needs Improvement",1,"The results suggest that you have the ability to calculate the mean for a set of whole number values; read basic statistical charts and graphs.  Recommended study:  calculate the mean and mode for a set of whole number values; read and interpret basic graphs such as line, circle, and bar graphs; simplify fractions to solve probability problems."]
["32",3,"Limited Proficiency",2,"The results suggest that you have the ability to calculate the mean and mode for a set of whole number values; read and interpret basic graphs such as line, circle, and bar graphs; simplify fractions to solve probability problems.  Recommended study:  calculate the mean, median, and mode for a set of whole number values; calculate the probability of a simple event; read and interpret basic statistical charts and graphs."]
["33",3,"Proficient",3,"The results suggest that you have the ability to calculate the mean, median, and mode for a set of whole number values; calculate the probability of a simple event; read and interpret basic statistical charts and graphs.  Recommended study: calculate the mean, median, mode, and range for a set of values; calculate the probability of a simple event and its complement; apply fundamental counting principles."]
{"$rows_left_out":10}
{"sheet":"Geometry and Measurement","index":5,"n_rows":19,"n_cols":5,"rows_kept":19,"cut":false,"hidden":true,"merged":[]}
["Concatenate","Placement Score","Strand Category","Strand Category","Geometry and Measurement"]
[{"$f":"CONCATENATE(B2,D2)","v":"11"},1,"Needs Improvement",1,"The results suggest that you have the ability to identify geometric shapes and common units of measure, convert inches to feet, and compute the perimeter of a triangle.  Recommended study:  Understand basic geometrical terminology, symbols and abbreviations, classify angles and compute basic area, perimeter and volume."]
[{"$f":"CONCATENATE(B3,D3)","v":"12"},1,"Limited Proficiency",2,"The results suggest that you have the ability to identify simple 2-D and 3-D geometric shapes and unit of measure (time, temperature, length, calendar), complete English conversions of length, compute the perimeter of rectangular prisms and construct basic bar graphs.  Recommended study: Understand Geometrical shapes; formulas (perimeter and area)."]
["13",1,"Proficient",3,"The results suggest that you have the ability to identify geometric shapes, complete English conversions of length and weight, compute perimeter of geometric shapes and create simple graphical representations for data.  You can also define geometric angles, lines, points, and rays.  Recommended study: Understand advanced Geometrical Shapes, formulas and solve 2-step equations.  Identify and plot points on a rectangular coordinate system."]
["21",2,"Needs Improvement",1,"The results suggest that you have the ability to identify geometric shapes and common units of measure, convert inches to feet, and compute the perimeter of a triangle.  Recommended study:  Understand basic geometrical terminology, symbols and abbreviations, classify angles and compute basic area, perimeter and volume."]
["22",2,"Limited Proficiency",2,"The results suggest that you have the ability to identify simple 2-D and 3-D geometric shapes and unit of measure (time, temperature, length, calendar), complete English conversions of length, compute the perimeter of rectangular prisms and construct basic bar graphs.  Recommended study: Understand Geometrical shapes; formulas (perimeter and area)."]
["23",2,"Proficient",3,"The results suggest that you have the ability to identify geometric shapes, complete English conversions of length and weight, compute perimeter of geometric shapes and create simple graphical representations for data.  You can also define geometric angles, lines, points, and rays.  Recommended study: Understand advanced Geometrical Shapes, formulas and solve 2-step equations.  Identify and plot points on a rectangular coordinate system."]
["31",3,"Needs Improvement",1,"The results suggest that you have the ability to identify basic geometric shapes and terminology, compute basic area, perimeter and measure whole units with precision.  You can classify geometric angles (e.g. acute, obtuse, right etc...). Recommended study:  Solve basic geometric problems involving 1-step, conversions; classify geometric lines."]
["32",3,"Limited Proficiency",2,"The results suggests that you have the ability to identify geometric shapes and terminology, angles and parallel lines, compute basic area, perimeter, volume, and conversions of length and weight given formulas involving 1-step.  Recommended study:  Solve two-step geometric problems and conversions; understand lines of symmetry, reflections and rotations."]
["33",3,"Proficient",3,"These results suggests that you have the ability to identify geometric shapes and terminology, angles and parallel lines, compute basic area, perimeter of 2-D shapes and conversions given formula involving 2-steps.  Recommended study:  Solve multi-step geometric problems with 3-D shapes; conversions of all measurements; understand lines of symmetry, reflections and rotations."]
{"$rows_left_out":10}
{"sheet":"Look Up tables","index":6,"n_rows":63,"n_cols":26,"rows_kept":63,"cut":false,"hidden":true,"merged":[[0,0,0,1],[1,24,1,25],[0,3,0,7],[0,9,0,13],[0,15,0,19],[0,21,0,22],[1,6,1,7],[1,21,1,22],[21,3,21,4],[1,12,1,13],[1,18,1,19],[1,9,1,10],[1,15,1,16],[1,3,1,4]]}
["Form T Placement Scores",null,null,"Number Sense",null,null,null,null,null,"Patterns, Functions, and Algebra",null,null,null,null,null,"Statistics and Probability",null,null,null,null,null,"Geometry and Measurement"]
["Raw Score","Scale Score",null,"Form T",null,null,"Form T",null,null,"Form T",null,null,"Form T",null,null,"Form T",null,null,"Form T",null,null,"Form T",null,null,"Form T"]
[0,1,null,"Raw Score","Category Score",null,null,null,null,"Raw Score","Category Score",null,null,null,null,"Raw Score","Category Score",null,null,null,null,"Raw Score","Category Score"]
[1,1,null,0,1,null,1,1,null,0,1,null,1,1,null,0,1,null,1,1,null,0,1,null,1,1]
[2,1,null,1,1,null,2,1,null,1,1,null,2,1,null,1,1,null,2,1,null,1,1,null,2,1]
[3,1,null,2,1,null,3,1,null,2,1,null,3,1,null,2,1,null,3,1,null,2,1,null,3,1]
[4,1,null,3,1,null,4,1,null,3,1,null,4,1,null,3,1,null,4,1,null,3,1,null,4,1]
[5,1,null,4,1,null,5,2,null,4,1,null,5,2,null,4,2,null,5,2,null,4,2,null,5,2]
[6,2,null,5,2,null,6,2,null,5,2,null,6,2,null,5,3,null,6,2,null,5,3,null,6,2]
[7,2,null,6,3,null,7,2,null,6,3,null,7,2,null,6,3,null,7,2,null,6,3,null,7,2]
{"$rows_left_out":53}